Before: t27c suite, one spec at a time
T27_SUITE_JOBS=1: about 13,000 per-spec runs, one after another.
t27 · before: t27c suite, one spec at a time
FAIL seal-verify (specs/port/trios/crates/trios-scarab-types/rings/SR-03/src/lib.t27): seal verify: spec
_hash: MISMATCH (saved=sha256:9c2d461fa5458c0e28ec82a145717b3c4cf9736dbccb604fbc9e2a0947e7b2cc, current=
sha256:aacf2d95b578f3ebb9e65a42a46b6464137650958381965a912e4e8a4eebe058)
gen_hash_zig: MISMATCH (saved=sha256:fc5566ed2544546684bdda0e0a51aa11097b0e0d3dbc1a1f3cf3de157f328524, c
urrent=sha256:8f16792268abf618acfe34db22cfb8be640025e6d1d215841225cfe8790957b9)
gen_hash_verilog: MISMATCH (saved=sha256:903121d87fc42c4dd16e658a074e97faeacedeb5f052efc1bf568ebe7477184
9, current=sha256:5688b390e1f855e7b2bcec484e460cd1e86b944ae5a6bd165fe39c7daf26b062)
gen_hash_c: MISMATCH (saved=sha256:001e97092e6089f96157164cf9724a2d59a6cb308fb28ab95070a12b9adde03c, cur
rent=sha256:bb70a102a5a509c637faf8d57152f86e0af950b36f0ac83b19589c9d3102ab2a)
gen_hash_rust: MISMATCH (saved=sha256:1b7dd0d8390696342953925df9983f8cdd4db9108bd1f2ebf92b7c8ba3ba2dbc,
current=sha256:bb2527093f4accd99d7ca4598a4599962f3249295936b556438bfb73c28f1d3a)
VERIFICATION FAILED — hashes differ from saved seal
FAIL seal-verify (specs/port/trios/crates/trios-server/src/mcp_endpoints/experience.t27): seal verify:
Error: No saved seal found at .trinity/seals/mcp_endpoints_port::trios::server::src::mcp_endpoints::expe
rience.json. Run with --save first.
FAIL seal-verify (specs/port/trios/crates/trios-ternary/rings/TR-00/src/lib.t27): seal verify: Error: N
o saved seal found at .trinity/seals/src_port::trios::crates::trios-ternary::rings::TR_00::src.json. Run
with --save first.
FAIL seal-verify (specs/ui/viewport.t27): seal verify: Error: No saved seal found at .trinity/seals/ui_
ui_viewport.json. Run with --save first.
--- Phase 6: Fixed Point ---
--- Phase 6: Integrity metrics (reporting only) ---
(reporting only -- not counted in TOTAL FAILURES)
--- Phase 7: Gates (failures count) ---
TOTAL FAILURES: 258
NOTE: TOTAL FAILURES sums GATED phases, so a single unparseable spec is
Error: SOME TESTS FAILED
real 479.557s
t27 $
recorded 2026-10-11 07:05 UTC real 481.0 s shown 47.4 s
$ time T27_SUITE_JOBS=1 tri hot suite | grep --line-buffered -E '^--- Phase|TOTAL FAILURES'
Staged: the prompt and the typing. Real: every byte the commands printed, at the time they printed it. Any silence longer than 2 s is shown for 2 s; `time` prints the real duration. Edited: home directory shown as ~, temp directory shown as $TMPDIR.